Target
Gamma-aminobutyric acid receptor subunit alpha-6 [20-453]/beta-2 [26-512]/gamma-2 [40-467]
Ligand
BDBM26266
Substrate
BDBM26267
Meas. Tech.
Radioligand Binding Assay
pH
7.4±n/a
Temperature
295.15±n/a K
Ki
>15000±n/a nM
Citation
 Hanson, SMMorlock, EVSatyshur, KACzajkowski, C Structural Requirements for Eszopiclone and Zolpidem Binding to the gamma-Aminobutyric Acid Type-A (GABAA) Receptor Are Different. J Med Chem 51:7243-52 (2008)  
Target
Name:
Gamma-aminobutyric acid receptor subunit alpha-6 [20-453]/beta-2 [26-512]/gamma-2 [40-467]
Synonyms:
GABAA Receptor, alpha-6, beta-2, gamma-2
Type:
Protein Complex
Mol. Mass.:
Description:
Components:
This complex has 3 components.
Component 1
Name:
Gamma-aminobutyric acid receptor subunit gamma-2 [40-467]
Synonyms:
GABA(A) receptor subunit gamma-2 GABRG2 Gamma-aminobutyric acid receptor subunit gamma-2
Type:
Ionic channel
Mol. Mass.:
49862.76
Organism:
Homo sapiens (Human)
Description:
P18507[40-467]
Residue:
428
  
Component 2
Name:
Gamma-aminobutyric acid receptor subunit beta-2 [26-512]
Synonyms:
GABA(A) receptor subunit beta-2 GABRB2 Gamma-aminobutyric acid receptor subunit beta-2
Type:
Ionic channel
Mol. Mass.:
56212.32
Organism:
Homo sapiens (Human)
Description:
P47870[26-512]
Residue:
487
  
Component 3
Name:
Gamma-aminobutyric acid receptor subunit alpha-6 [20-453]
Synonyms:
GABA(A) receptor subunit alpha-6 GABRA6 Gamma-aminobutyric acid receptor subunit alpha-6
Type:
Ionic channel
Mol. Mass.:
48918.05
Organism:
Homo sapiens (Human)
Description:
Q16445[20-453]
Residue:
434
  
Inhibitor
Name:
BDBM26266
Synonyms:
Ambien Dalparan ZPM Zolpidem tartrate
Type:
Small organic molecule
Emp. Form.:
C19H21N3O
Mol. Mass.:
307.3895
SMILES:
CN(C)C(=O)Cc1c(nc2ccc(C)cn12)-c1ccc(C)cc1
:
Substrate
Name:
BDBM26267
Synonyms:
RO-154513 [3H]Ro15-4513 | ethyl 12-azido-8-methyl-9-oxo-2,4,8-triazatricyclo[8.4.0.0^{2,6}]tetradeca-1(10),3,5,11,13-pentaene-5-carboxylate
Type:
radiolabeled ligand
Emp. Form.:
C15H14N6O3
Mol. Mass.:
326.3101
SMILES:
CCOC(=O)c1ncn-2c1CN(C)C(=O)c1cc(ccc-21)N=[N+]=[N-]
: