Target
cGMP-dependent 3',5'-cyclic phosphodiesterase
Ligand
BDBM385960
Substrate
Meas. Tech.
PDE2 Inhibition Assay
Ki
2800±n/a nM
Citation
 Stachel, SJDwyer, MPSinz, CJWilson, JEPaone, DVChen, YXu, S Bicyclic heterocyclic compounds as PDE2 inhibitors US Patent  US10287293 Publication Date 5/14/2019 
Target
Name:
cGMP-dependent 3',5'-cyclic phosphodiesterase
Synonyms:
CGS-PDE Homo sapiens phosphodiesterase 2A (PDE2A) PDE2A cGSPDE
Type:
Enzyme Catalytic Domain
Mol. Mass.:
105691.58
Organism:
Homo sapiens (Human)
Description:
O00408
Residue:
941
  
Inhibitor
Name:
BDBM385960
Synonyms:
(R)- or (S)-3- (1-(2- Fluoro- 3- (trifluoro- methyl) phenyl) ethyl)- 1-(2- hydroxy- ethyl)-5- methyl- 1,6- dihydro- 7H- pyrazolo [4,3-d] pyrimi-din-7-one US10287293, Example 9
Type:
Small organic molecule
Emp. Form.:
C17H16F4N4O2
Mol. Mass.:
384.3282
SMILES:
CC(c1nn(CCO)c2c1nc(C)[nH]c2=O)c1cccc(c1F)C(F)(F)F
: