Target
TGF-beta receptor type-1 [T204D]
Ligand
BDBM283034
Substrate
Meas. Tech.
Biological Assay
IC50
1.000±n/a nM
Citation
 Kinsella, TGelman, MHong, HDarwish, ISSingh, RYu, JBorzilleri, RMVelaparthi, ULiu, PDarne, CPRahaman, HWarrier, JS TGF-β inhibitors US Patent  US10287295 Publication Date 5/14/2019 
Target
Name:
TGF-beta receptor type-1 [T204D]
Synonyms:
ALK5 TGF-beta receptor type-1 (T204D) TGFBR1 TGFR-1 (T204D) | TGFR1_HUMAN
Type:
Mol. Mass.:
55981.22
Organism:
Homo sapiens (Human)
Description:
P36897[T204D]
Residue:
503
  
Inhibitor
Name:
BDBM283034
Synonyms:
6-(4-(5-chloro-2,4-difluorophenyl)-1-(2,2- difluoroethyl)-1H-imidazol-5-yl)imidazo[1,2- a]pyridine-3-carboxamide US11352360, Example 235' | US9884868, Example 235'
Type:
Small organic molecule
Emp. Form.:
C19H12ClF4N5O
Mol. Mass.:
437.778
SMILES:
NC(=O)c1cnc2ccc(cn12)-c1c(ncn1CC(F)F)-c1cc(Cl)c(F)cc1F
: