Target
Proline-rich AKT1 substrate 1
Ligand
BDBM386032
Substrate
Meas. Tech.
AKT Enzyme Assay
IC50
>1000±n/a nM
Citation
 Lan, RHuck, BRChen, XXiao, Y Heterocyclic derivatives as modulators of kinase activity US Patent  US10287300 Publication Date 5/14/2019 
Target
Name:
Proline-rich AKT1 substrate 1
Synonyms:
40 kDa proline-rich AKT substrate AKTS1_HUMAN | PRAS40
Type:
PROTEIN
Mol. Mass.:
27368.40
Organism:
Homo sapiens (Human)
Description:
ChEMBL_664853
Residue:
256
  
Inhibitor
Name:
BDBM386032
Synonyms:
4-(4-(2-(azetidin-1-yl)-1-(2-fluorophenyl)ethyl)piperazin-1-yl)-7,8-dihydropteridin-6(5H)-one | US10287300, Compound A37
Type:
Small organic molecule
Emp. Form.:
C21H26FN7O
Mol. Mass.:
411.4758
SMILES:
Fc1ccccc1C(CN1CCC1)N1CCN(CC1)c1ncnc2NCC(=O)Nc12
: