Target
Ribosomal protein S6 kinase beta-1 [T412E]
Ligand
BDBM386045
Substrate
Meas. Tech.
P70S6K Enzyme Assay
IC50
>1000±n/a nM
Citation
 Lan, RHuck, BRChen, XXiao, Y Heterocyclic derivatives as modulators of kinase activity US Patent  US10287300 Publication Date 5/14/2019 
Target
Name:
Ribosomal protein S6 kinase beta-1 [T412E]
Synonyms:
KS6B1_HUMAN RPS6KB1 p70 ribosomal S6 kinase alpha (P70S6K)(T412E)
Type:
Enzyme Catalytic Domain
Mol. Mass.:
59166.89
Organism:
Homo sapiens (Human)
Description:
P23443[T412E]
Residue:
525
  
Inhibitor
Name:
BDBM386045
Synonyms:
4-(4-(1-(3,4-difluorophenyl)-2-(dimethylamino)ethyl)piperazin-1-yl)-7,8-dihydropteridin-6(5H)-one | US10287300, Compound A49
Type:
Small organic molecule
Emp. Form.:
C20H25F2N7O
Mol. Mass.:
417.4556
SMILES:
CN(C)CC(N1CCN(CC1)c1ncnc2NCC(=O)Nc12)c1ccc(F)c(F)c1
: