Target
Fatty acid-binding protein 5
Ligand
BDBM263042
Substrate
IC50
1220±n/a nM
Citation
 Buettelmann, BCeccarelli, SMConte, AKuehne, HKuhn, BNeidhart, WSander, UORichter, H Urea derivatives and their use as fatty-acid binding protein (FABP) inhibitors US Patent  US9708340 Publication Date 7/18/2017 
Target
Name:
Fatty acid-binding protein 5
Synonyms:
FABP5 Fatty acid binding protein epidermal | Fatty acid-binding protein 5 (FABP5)
Type:
Enzyme
Mol. Mass.:
15164.79
Organism:
Homo sapiens (Human)
Description:
Q01469
Residue:
135
  
Inhibitor
Name:
BDBM263042
Synonyms:
US9708340, 19
Type:
Small organic molecule
Emp. Form.:
C24H21ClN2O3
Mol. Mass.:
420.888
SMILES:
OC(=O)[C@H]1CCCN1C(=O)Nc1cc(Cl)cc(-c2ccccc2)c1-c1ccccc1
: