Target
Fatty acid-binding protein 5
Ligand
BDBM263060
Substrate
IC50
42230±n/a nM
Citation
 Buettelmann, BCeccarelli, SMConte, AKuehne, HKuhn, BNeidhart, WSander, UORichter, H Urea derivatives and their use as fatty-acid binding protein (FABP) inhibitors US Patent  US9708340 Publication Date 7/18/2017 
Target
Name:
Fatty acid-binding protein 5
Synonyms:
FABP5 Fatty acid binding protein epidermal | Fatty acid-binding protein 5 (FABP5)
Type:
Enzyme
Mol. Mass.:
15164.79
Organism:
Homo sapiens (Human)
Description:
Q01469
Residue:
135
  
Inhibitor
Name:
BDBM263060
Synonyms:
US9708340, 53
Type:
Small organic molecule
Emp. Form.:
C20H17ClN2O3S
Mol. Mass.:
400.879
SMILES:
OC(=O)[C@H]1CCCN1C(=O)Nc1cc(Cl)ccc1-c1csc2ccccc12
: