Target
Complement factor D
Ligand
BDBM386359
Substrate
Meas. Tech.
Human Factor D Assay
IC50
<1000±n/a nM
Citation
 Wiles, JAPhadke, ASDeshpande, MAgarwal, AChen, DGadhachanda, VRHashimoto, APais, GWang, QWang, X Aryl, heteroaryl, and heterocyclic compounds for treatment of medical disorders US Patent  US10287301 Publication Date 5/14/2019 
Target
Name:
Complement factor D
Synonyms:
Adipsin CFAD_HUMAN DF Properdin factor D
Type:
Protein
Mol. Mass.:
27039.19
Organism:
Homo sapiens (Human)
Description:
P00746
Residue:
253
  
Inhibitor
Name:
BDBM386359
Synonyms:
6-(3-acetyl-1-(2- ((2S,4R)-2-(6- bromopyridin-2- ylcarbamoyl)-4- fluoropyrrolidin-1- yl)-2-oxoethyl)-1H- indazol-5- yl)pyrazolo[1,5- a]pyrimidine-2- carboxamide US10822352, Comp No. 288
Type:
Small organic molecule
Emp. Form.:
C28H23BrFN9O4
Mol. Mass.:
648.443
SMILES:
CC(=O)c1nn(CC(=O)N2C[C@H](F)C[C@H]2C(=O)Nc2cccc(Br)n2)c2ccc(cc12)-c1cnc2cc(nn2c1)C(N)=O
: