Target
Complement factor D
Ligand
BDBM386628
Substrate
Meas. Tech.
Human Factor D Assay
IC50
<1000±n/a nM
Citation
 Wiles, JAPhadke, ASDeshpande, MAgarwal, AChen, DGadhachanda, VRHashimoto, APais, GWang, QWang, X Aryl, heteroaryl, and heterocyclic compounds for treatment of medical disorders US Patent  US10287301 Publication Date 5/14/2019 
Target
Name:
Complement factor D
Synonyms:
Adipsin CFAD_HUMAN DF Properdin factor D
Type:
Protein
Mol. Mass.:
27039.19
Organism:
Homo sapiens (Human)
Description:
P00746
Residue:
253
  
Inhibitor
Name:
BDBM386628
Synonyms:
(2S,4R)-1-(2-(3- acetyl-5-(2- methylpyrimidin- 5-yl)-1H-indazol- 1-yl)acetyl)-N-(6- cyclopropylpyridin- 2-yl)-4- fluoropyrrolidine- 2-carboxamide US10822352, Comp No. 576
Type:
Small organic molecule
Emp. Form.:
C29H28FN7O3
Mol. Mass.:
541.5761
SMILES:
CC(=O)c1nn(CC(=O)N2C[C@H](F)C[C@H]2C(=O)Nc2cccc(n2)C2CC2)c2ccc(cc12)-c1cnc(C)nc1
: