Target
Orexin receptor type 2
Ligand
BDBM386158
Substrate
Meas. Tech.
Measurement of Orexin Type 2 Receptor Agonist Activity
EC50
3500±n/a nM
Citation
 Fujimoto, TRikimaru, KSugimoto, HMatsumoto, T Substituted piperidine compound and use thereof US Patent  US10287305 Publication Date 5/14/2019 
Target
Name:
Orexin receptor type 2
Synonyms:
HCRTR2 OX2R_HUMAN Orexin receptor type 2 (OR-2) Orexin receptor type 2 (OX2R) Ox-2-R | Ox2-R
Type:
Protein
Mol. Mass.:
50710.53
Organism:
Homo sapiens (Human)
Description:
O43614
Residue:
444
  
Inhibitor
Name:
BDBM386158
Synonyms:
N-(cis-1-acetyl-2-(((cis-3- phenylcyclobutyl)oxy)methyl)-piperidin- 3-yl)methanesulfonamidea US10508083, Example 114 | US11292766, Example 114
Type:
Small organic molecule
Emp. Form.:
C19H28N2O4S
Mol. Mass.:
380.502
SMILES:
CC(=O)N1CCC[C@H](NS(C)(=O)=O)[C@@H]1CO[C@H]1C[C@H](C1)c1ccccc1
: