Target
Aurora kinase A
Ligand
BDBM26309
Substrate
FAM-PKAtide
Meas. Tech.
Aurora Kinase Assay
pH
7.2±n/a
Temperature
294.15±n/a K
IC50
3200±n/a nM
Citation
 Oslob, JDRomanowski, MJAllen, DABaskaran, SBui, MElling, RAFlanagan, WMFung, ADHanan, EJHarris, SHeumann, SAHoch, UJacobs, JWLam, JLawrence, CEMcDowell, RSNannini, MAShen, WSilverman, JASopko, MMTangonan, BTTeague, JYoburn, JCYu, CHZhong, MZimmerman, KMO'Brien, TLew, W Discovery of a potent and selective aurora kinase inhibitor. Bioorg Med Chem Lett 18:4880-4 (2008)  
Target
Name:
Aurora kinase A
Synonyms:
AURKA_MOUSE Airk1 Aura Aurora Kinase A (Aurora-A) Aurora-family kinase 1 Ayk1 Iak1 Serine/threonine-protein kinase Aurora-A Stk15 | Stk6
Type:
Enzyme
Mol. Mass.:
44791.66
Organism:
Mus musculus (mouse)
Description:
Residue:
395
  
Inhibitor
Name:
BDBM26309
Synonyms:
CHEMBL459888 thieno[3,2-d]pyrimidine analogue, 1
Type:
Small organic molecule
Emp. Form.:
C22H17F3N4OS
Mol. Mass.:
442.457
SMILES:
FC(F)(F)c1cccc(c1)C(=O)Nc1ccc(CCNc2ncnc3ccsc23)cc1
:
Substrate
Name:
FAM-PKAtide
Synonyms:
Type:
fluorescien-labeled peptide
Mol. Mass.:
1620.33
Organism:
Description:
Residue:
14
FAMGRTGRRNSINH