Target
Aurora kinase A
Ligand
BDBM26334
Substrate
FAM-PKAtide
Meas. Tech.
Aurora Kinase Assay
pH
7.2±n/a
Temperature
294.15±n/a K
IC50
53±n/a nM
Citation
 Oslob, JDRomanowski, MJAllen, DABaskaran, SBui, MElling, RAFlanagan, WMFung, ADHanan, EJHarris, SHeumann, SAHoch, UJacobs, JWLam, JLawrence, CEMcDowell, RSNannini, MAShen, WSilverman, JASopko, MMTangonan, BTTeague, JYoburn, JCYu, CHZhong, MZimmerman, KMO'Brien, TLew, W Discovery of a potent and selective aurora kinase inhibitor. Bioorg Med Chem Lett 18:4880-4 (2008)  
Target
Name:
Aurora kinase A
Synonyms:
AURKA_MOUSE Airk1 Aura Aurora Kinase A (Aurora-A) Aurora-family kinase 1 Ayk1 Iak1 Serine/threonine-protein kinase Aurora-A Stk15 | Stk6
Type:
Enzyme
Mol. Mass.:
44791.66
Organism:
Mus musculus (mouse)
Description:
Residue:
395
  
Inhibitor
Name:
BDBM26334
Synonyms:
1-{3-[2-(azetidin-1-yl)ethyl]phenyl}-3-[5-(2-{thieno[3,2-d]pyrimidin-4-ylamino}ethyl)-1,3-thiazol-2-yl]urea | thieno[3,2-d]pyrimidine analogue, 29
Type:
Small organic molecule
Emp. Form.:
C23H25N7OS2
Mol. Mass.:
479.621
SMILES:
O=C(Nc1ncc(CCNc2ncnc3ccsc23)s1)Nc1cccc(CCN2CCC2)c1
:
Substrate
Name:
FAM-PKAtide
Synonyms:
Type:
fluorescien-labeled peptide
Mol. Mass.:
1620.33
Organism:
Description:
Residue:
14
FAMGRTGRRNSINH