Target
Aurora kinase B
Ligand
BDBM26329
Substrate
FAM-PKAtide
Meas. Tech.
Aurora Kinase Assay
IC50
13±n/a nM
Citation
 Oslob, JDRomanowski, MJAllen, DABaskaran, SBui, MElling, RAFlanagan, WMFung, ADHanan, EJHarris, SHeumann, SAHoch, UJacobs, JWLam, JLawrence, CEMcDowell, RSNannini, MAShen, WSilverman, JASopko, MMTangonan, BTTeague, JYoburn, JCYu, CHZhong, MZimmerman, KMO'Brien, TLew, W Discovery of a potent and selective aurora kinase inhibitor. Bioorg Med Chem Lett 18:4880-4 (2008)  
Target
Name:
Aurora kinase B
Synonyms:
AIK2 AIM1 ARK2 AURKB_HUMAN Aurora B-INCENP Aurora kinase B (AURKB) STK-1 STK12 Serine/threonine-protein kinase aurora B
Type:
Protein
Mol. Mass.:
39327.72
Organism:
Homo sapiens (Human)
Description:
Q96GD4
Residue:
344
  
Inhibitor
Name:
BDBM26329
Synonyms:
1-(3,4-dichlorophenyl)-3-[5-(2-{thieno[3,2-d]pyrimidin-4-ylamino}ethyl)-1,3-thiazol-2-yl]urea | thieno[3,2-d]pyrimidine analogue, 24
Type:
Small organic molecule
Emp. Form.:
C18H14Cl2N6OS2
Mol. Mass.:
465.379
SMILES:
Clc1ccc(NC(=O)Nc2ncc(CCNc3ncnc4ccsc34)s2)cc1Cl
:
Substrate
Name:
FAM-PKAtide
Synonyms:
Type:
fluorescien-labeled peptide
Mol. Mass.:
1620.33
Organism:
Description:
Residue:
14
FAMGRTGRRNSINH