Target
Free fatty acid receptor 4
Ligand
BDBM386989
Substrate
Meas. Tech.
GPR120 pERK assay
EC50
460±n/a nM
Citation
 Shi, YCheng, PTWang, YJusuf, STao, SZhang, HWu, SCRobl, JA Cyclopropanecarboxylic acid GPR120 modulators US Patent  US9938222 Publication Date 4/10/2018 
Target
Name:
Free fatty acid receptor 4
Synonyms:
FFAR4 G-protein coupled receptor 120 G-protein coupled receptor GT01 GPR120 O3FAR1 PGR4
Type:
PROTEIN
Mol. Mass.:
42256.91
Organism:
Homo sapiens (Human)
Description:
ChEMBL_1508994
Residue:
377
  
Inhibitor
Name:
BDBM386989
Synonyms:
US9938222, Example 118
Type:
Small organic molecule
Emp. Form.:
C24H20O4
Mol. Mass.:
372.4132
SMILES:
OC(=O)C1CC1COc1ccc(cc1)-c1cccc(c1)C(=O)c1ccccc1
: