Target
Genome polyprotein
Ligand
BDBM263074
Substrate
Meas. Tech.
Norovirus Polymerase Inhibition Assay
EC50
2000±n/a nM
Citation
 Bougher, III, JHChangalvala, RVDowney, ALDrach, JCLanier, Jr., ERMcIver, ALRobertson, BDSelleseth, DWSethna, PBTownsend, LWare, RW Pyrrolopyrimidine nucleosides and analogs thereof US Patent  US9708359 Publication Date 7/18/2017 
Target
Name:
Genome polyprotein
Synonyms:
Norovirus Polymerase
Type:
Mol. Mass.:
187250.43
Organism:
Murine norovirus 1
Description:
Q80J95
Residue:
1685
  
Inhibitor
Name:
BDBM263074
Synonyms:
US9708359, 3
Type:
Small organic molecule
Emp. Form.:
C16H22N6O6
Mol. Mass.:
394.3825
SMILES:
C[C@H](N)C(=O)OC[C@H]1O[C@H]([C@H](O)[C@@H]1O)n1cc(C(N)=O)c2c(N)nc(C)nc12
: