Target
Genome polyprotein
Ligand
BDBM263122
Substrate
Meas. Tech.
Norovirus Polymerase Inhibition Assay
EC50
>100000±n/a nM
Citation
 Bougher, III, JHChangalvala, RVDowney, ALDrach, JCLanier, Jr., ERMcIver, ALRobertson, BDSelleseth, DWSethna, PBTownsend, LWare, RW Pyrrolopyrimidine nucleosides and analogs thereof US Patent  US9708359 Publication Date 7/18/2017 
Target
Name:
Genome polyprotein
Synonyms:
Norovirus Polymerase
Type:
Mol. Mass.:
187250.43
Organism:
Murine norovirus 1
Description:
Q80J95
Residue:
1685
  
Inhibitor
Name:
BDBM263122
Synonyms:
US9708359, 48 US9708359, 81
Type:
Small organic molecule
Emp. Form.:
C12H16N4O4
Mol. Mass.:
280.2798
SMILES:
Cc1nc(N)c2ccn([C@@H]3O[C@H](CO)[C@@H](O)[C@H]3O)c2n1
: