Target
Genome polyprotein
Ligand
BDBM263164
Substrate
Meas. Tech.
Norovirus Polymerase Inhibition Assay
EC50
>100000±n/a nM
Citation
 Bougher, III, JHChangalvala, RVDowney, ALDrach, JCLanier, Jr., ERMcIver, ALRobertson, BDSelleseth, DWSethna, PBTownsend, LWare, RW Pyrrolopyrimidine nucleosides and analogs thereof US Patent  US9708359 Publication Date 7/18/2017 
Target
Name:
Genome polyprotein
Synonyms:
Norovirus Polymerase
Type:
Mol. Mass.:
187250.43
Organism:
Murine norovirus 1
Description:
Q80J95
Residue:
1685
  
Inhibitor
Name:
BDBM263164
Synonyms:
US9708359, 128
Type:
Small organic molecule
Emp. Form.:
C21H25N5O9
Mol. Mass.:
491.4513
SMILES:
CC(=O)Nc1nc(C)nc2n(cc(C(N)=O)c12)[C@@H]1O[C@H](COC(C)=O)[C@@H](OC(C)=O)[C@H]1OC(C)=O
: