Target
Genome polyprotein
Ligand
BDBM263205
Substrate
Meas. Tech.
Norovirus Polymerase Inhibition Assay
EC50
>100000±n/a nM
Citation
 Bougher, III, JHChangalvala, RVDowney, ALDrach, JCLanier, Jr., ERMcIver, ALRobertson, BDSelleseth, DWSethna, PBTownsend, LWare, RW Pyrrolopyrimidine nucleosides and analogs thereof US Patent  US9708359 Publication Date 7/18/2017 
Target
Name:
Genome polyprotein
Synonyms:
Norovirus Polymerase
Type:
Mol. Mass.:
187250.43
Organism:
Murine norovirus 1
Description:
Q80J95
Residue:
1685
  
Inhibitor
Name:
BDBM263205
Synonyms:
US9708359, 105
Type:
Small organic molecule
Emp. Form.:
C13H16N8O5
Mol. Mass.:
364.3167
SMILES:
Cc1nc(N)c2c(cn([C@@H]3O[C@@](CO)(N=[N+]=[N-])[C@@H](O)[C@H]3O)c2n1)C(N)=O
: