Target
Genome polyprotein
Ligand
BDBM263212
Substrate
Meas. Tech.
Norovirus Polymerase Inhibition Assay
EC50
5500±n/a nM
Citation
 Bougher, III, JHChangalvala, RVDowney, ALDrach, JCLanier, Jr., ERMcIver, ALRobertson, BDSelleseth, DWSethna, PBTownsend, LWare, RW Pyrrolopyrimidine nucleosides and analogs thereof US Patent  US9708359 Publication Date 7/18/2017 
Target
Name:
Genome polyprotein
Synonyms:
Norovirus Polymerase
Type:
Mol. Mass.:
187250.43
Organism:
Murine norovirus 1
Description:
Q80J95
Residue:
1685
  
Inhibitor
Name:
BDBM263212
Synonyms:
US9708359, 127
Type:
Small organic molecule
Emp. Form.:
C16H22N6O5
Mol. Mass.:
378.3831
SMILES:
CN(C)\C=N\c1nc(C)nc2n(cc(C(N)=O)c12)[C@@H]1O[C@H](CO)[C@@H](O)[C@H]1O
: