Target
Glutaminase kidney isoform, mitochondrial [63-669]
Ligand
BDBM387020
Substrate
Meas. Tech.
Enzyme Potency Assay
IC50
98.9±n/a nM
Citation
 Nissink, JWFinlay, MRCharles, MDWood, M 1,3,4-thiadiazole compounds and their use in treating cancer US Patent  US9938265 Publication Date 4/10/2018 
Target
Name:
Glutaminase kidney isoform, mitochondrial [63-669]
Synonyms:
GLS GLSK_HUMAN K-glutaminase L-glutamine amidohydrolase
Type:
Mol. Mass.:
66963.68
Organism:
Homo sapiens (Human)
Description:
O94925 aa 63-669
Residue:
607
  
Inhibitor
Name:
BDBM387020
Synonyms:
(2S)-2-[3-(difluoromethoxy)phenyl]-N-[5-[[(3R)-1-(6-fluoropyridazin-3-yl)pyrrolidin-3-yl]amino]-1,3,4-thiadiazol-2-yl]-2-methoxy-acetamide and (2R)-2-[3-(difluoromethoxy)phenyl]-N-[5-[[(3R)-1-(6-fluoropyridazin-3-yl)pyrrolidin-3-yl]amino]-1,3,4-thiadiazol-2-yl]-2-methoxy-acetamide | US9938265, Example 9(b)
Type:
Small organic molecule
Emp. Form.:
C20H20F3N7O3S
Mol. Mass.:
495.478
SMILES:
CO[C@@H](C(=O)Nc1nnc(N[C@@H]2CCN(C2)c2ccc(F)nn2)s1)c1cccc(OC(F)F)c1
: