Target
Glutaminase kidney isoform, mitochondrial [63-669]
Ligand
BDBM387042
Substrate
Meas. Tech.
Enzyme Potency Assay
IC50
119±n/a nM
Citation
 Nissink, JWFinlay, MRCharles, MDWood, M 1,3,4-thiadiazole compounds and their use in treating cancer US Patent  US9938265 Publication Date 4/10/2018 
Target
Name:
Glutaminase kidney isoform, mitochondrial [63-669]
Synonyms:
GLS GLSK_HUMAN K-glutaminase L-glutamine amidohydrolase
Type:
Mol. Mass.:
66963.68
Organism:
Homo sapiens (Human)
Description:
O94925 aa 63-669
Residue:
607
  
Inhibitor
Name:
BDBM387042
Synonyms:
2-methoxy-2-(4-methoxyphenyl)-N-[5-[[(3R)-1-(6-methylpyridazin-3-yl)pyrrolidin-3-yl]amino]-1,3,4-thiadiazol-2-yl]acetamide US9938265, Example 30
Type:
Small organic molecule
Emp. Form.:
C21H25N7O3S
Mol. Mass.:
455.533
SMILES:
COC(C(=O)Nc1nnc(N[C@@H]2CCN(C2)c2ccc(C)nn2)s1)c1ccc(OC)cc1
: