Target
Glutaminase kidney isoform, mitochondrial
Ligand
BDBM47230
Substrate
Meas. Tech.
Recombinant Enzyme Assay
IC50
2.00±n/a nM
Citation
 Li, JChen, LGoyal, BLaidig, GStanton, TFSjogren, EB Heterocyclic inhibitors of glutaminase US Patent  US9938267 Publication Date 4/10/2018 
Target
Name:
Glutaminase kidney isoform, mitochondrial
Synonyms:
GLS GLSK_HUMAN K-glutaminase L-glutamine amidohydrolase
Type:
Protein
Mol. Mass.:
73471.89
Organism:
Homo sapiens (Human)
Description:
O94925
Residue:
669
  
Inhibitor
Name:
BDBM47230
Synonyms:
US8604016, 645 | US9938267, Cmpd ID 645
Type:
Emp. Form.:
C31H36N6O4S2
Mol. Mass.:
620.785
SMILES:
CCCCS(=O)(=O)Cc1cccc(CC(=O)Nc2ccc(CCCCc3nnc(NC(=O)Cc4ccccc4)s3)nn2)c1
: