Target
Coagulation factor X
Ligand
BDBM387064
Substrate
Meas. Tech.
In Vitro Assay
Ki
525±n/a nM
Citation
 Ding, ZLai, GChen, SYan, X Hydrazine compound as blood coagulation factor Xa inhibitor US Patent  US9938272 Publication Date 4/10/2018 
Target
Name:
Coagulation factor X
Synonyms:
Coagulation factor X precursor FA10_RAT Stuart factor
Type:
Enzyme
Mol. Mass.:
54255.03
Organism:
Rattus norvegicus (rat)
Description:
Residue:
482
  
Inhibitor
Name:
BDBM387064
Synonyms:
7-Oxo-6-(1-(3-oxomorpholino)piperidin-4-yl)-1-(4-(trifluoromethoxy)phenyl)-4,5,6,7-tetr a hydro-1H-pyrazolo[3,4-c]pyridine-3-carboxamide | US9938272, Example 10
Type:
Small organic molecule
Emp. Form.:
C23H25F3N6O5
Mol. Mass.:
522.477
SMILES:
NC(=O)c1nn(c2c1CCN(C1CCN(CC1)N1CCOCC1=O)C2=O)-c1ccc(OC(F)(F)F)cc1
: