Target
Coagulation factor X
Ligand
BDBM387071
Substrate
Meas. Tech.
In Vitro Assay
Ki
525±n/a nM
Citation
 Ding, ZLai, GChen, SYan, X Hydrazine compound as blood coagulation factor Xa inhibitor US Patent  US9938272 Publication Date 4/10/2018 
Target
Name:
Coagulation factor X
Synonyms:
Activated coagulation factor X (FXa) Coagulation factor X precursor F10 Factor X heavy chain Factor Xa Stuart-Prower factor
Type:
Enzyme
Mol. Mass.:
54726.60
Organism:
Homo sapiens (Human)
Description:
Residue:
488
  
Inhibitor
Name:
BDBM387071
Synonyms:
N5-Ethyl-1-(4-methoxyphenyl)-N5-(1-(3-oxomorpholino)piperidin-4-yl)-1H-pyrazole-3,5-dicarboxamide | US9938272, Example 17
Type:
Small organic molecule
Emp. Form.:
C23H30N6O5
Mol. Mass.:
470.5215
SMILES:
CCN(C1CCN(CC1)N1CCOCC1=O)C(=O)c1cc(nn1-c1ccc(OC)cc1)C(N)=O
: