Target
Prothrombin
Ligand
BDBM387085
Substrate
Meas. Tech.
In Vitro Assay
Ki
>1000±n/a nM
Citation
 Ding, ZLai, GChen, SYan, X Hydrazine compound as blood coagulation factor Xa inhibitor US Patent  US9938272 Publication Date 4/10/2018 
Target
Name:
Prothrombin
Synonyms:
Activation peptide fragment 1 Coagulation factor II Prothrombin precursor Thrombin heavy chain | Thrombin light chain
Type:
Protein
Mol. Mass.:
70029.57
Organism:
Homo sapiens (Human)
Description:
P00734
Residue:
622
  
Inhibitor
Name:
BDBM387085
Synonyms:
3-(7-Oxo-6-(1-(3-oxomorpholino)piperidin-4-yl)-3-(trifluoromethyl)-4,5,6,7-tetrahydro-1H-pyrazolo[3,4-c]pyridin-1-yl)benzamide | US9938272, Example 31
Type:
Small organic molecule
Emp. Form.:
C23H25F3N6O4
Mol. Mass.:
506.4776
SMILES:
NC(=O)c1cccc(c1)-n1nc(c2CCN(C3CCN(CC3)N3CCOCC3=O)C(=O)c12)C(F)(F)F
: