Target
Orexin receptor type 2
Ligand
BDBM387048
Substrate
Meas. Tech.
FLIPR Assay
IC50
40.5±n/a nM
Citation
 Kim, RMKuduk, SDLiverton, NZhou, G 6,5-bicyclic octahydropyrrolopyridine orexin receptor antagonists US Patent  US9938276 Publication Date 4/10/2018 
Target
Name:
Orexin receptor type 2
Synonyms:
HCRTR2 OX2R_HUMAN Orexin receptor type 2 (OR-2) Orexin receptor type 2 (OX2R) Ox-2-R | Ox2-R
Type:
Protein
Mol. Mass.:
50710.53
Organism:
Homo sapiens (Human)
Description:
O43614
Residue:
444
  
Inhibitor
Name:
BDBM387048
Synonyms:
US9938276, A1
Type:
Small organic molecule
Emp. Form.:
C22H21N7O
Mol. Mass.:
399.4484
SMILES:
O=C(N1CC[C@@H]2CCN([C@@H]2C1)c1cc(ccn1)C#N)c1ccccc1-n1nccn1
: