Target
Orexin receptor type 2
Ligand
BDBM387098
Substrate
Meas. Tech.
FLIPR Assay
IC50
10000±n/a nM
Citation
 Kim, RMKuduk, SDLiverton, NZhou, G 6,5-bicyclic octahydropyrrolopyridine orexin receptor antagonists US Patent  US9938276 Publication Date 4/10/2018 
Target
Name:
Orexin receptor type 2
Synonyms:
HCRTR2 OX2R_HUMAN Orexin receptor type 2 (OR-2) Orexin receptor type 2 (OX2R) Ox-2-R | Ox2-R
Type:
Protein
Mol. Mass.:
50710.53
Organism:
Homo sapiens (Human)
Description:
O43614
Residue:
444
  
Inhibitor
Name:
BDBM387098
Synonyms:
US9938276, A12 | methyl 6-((3aR, 7aR)-6-(2-(2H-1,2,3-triazol-2- yl)benzoyl)octahydro-1H-pyrrolo[2,3- c]pyridin-1-yl)pyridazine-3-carboxylate
Type:
Small organic molecule
Emp. Form.:
C26H28N8O
Mol. Mass.:
468.5535
SMILES:
Cc1ccc(C)n1-c1ccc(nn1)N1CC[C@@H]2CCN(C[C@H]12)C(=O)c1ccccc1-n1nccn1
: