Target
Orexin receptor type 2
Ligand
BDBM387105
Substrate
Meas. Tech.
FLIPR Assay
IC50
95.5±n/a nM
Citation
 Kim, RMKuduk, SDLiverton, NZhou, G 6,5-bicyclic octahydropyrrolopyridine orexin receptor antagonists US Patent  US9938276 Publication Date 4/10/2018 
Target
Name:
Orexin receptor type 2
Synonyms:
HCRTR2 OX2R_HUMAN Orexin receptor type 2 (OR-2) Orexin receptor type 2 (OX2R) Ox-2-R | Ox2-R
Type:
Protein
Mol. Mass.:
50710.53
Organism:
Homo sapiens (Human)
Description:
O43614
Residue:
444
  
Inhibitor
Name:
BDBM387105
Synonyms:
3-chloro-2-[(3aR, 7aR)-6-{[2-(2H-1,2,3-triazol- 2-yl)phenyl]carbonyl}octahydro-1H- pyrrolo[2,3-c]pyridin-1-yl]pyridine-4- carbonitrile | US9938276, A19
Type:
Small organic molecule
Emp. Form.:
C23H28N8O
Mol. Mass.:
432.5214
SMILES:
CN(C)c1cc(C)nc(n1)N1CC[C@@H]2CCN(C[C@H]12)C(=O)c1ccccc1-n1nccn1
: