Target
Orexin/Hypocretin receptor type 1
Ligand
BDBM387129
Substrate
Meas. Tech.
FLIPR Assay
IC50
10000±n/a nM
Citation
 Kim, RMKuduk, SDLiverton, NZhou, G 6,5-bicyclic octahydropyrrolopyridine orexin receptor antagonists US Patent  US9938276 Publication Date 4/10/2018 
Target
Name:
Orexin/Hypocretin receptor type 1
Synonyms:
HCRTR1 OX1R_HUMAN Orexin receptor type 1 (OR 1) Orexin receptor type 1 (OX1) Orexin receptor type 1 (OxR1) | Ox1r
Type:
Protein
Mol. Mass.:
47554.50
Organism:
Homo sapiens (Human)
Description:
O43613
Residue:
425
  
Inhibitor
Name:
BDBM387129
Synonyms:
US9938276, C1
Type:
Small organic molecule
Emp. Form.:
C22H26N6O2S
Mol. Mass.:
438.546
SMILES:
CC(C)(O)c1csc(n1)-c1ccccc1C(=O)N1CC[C@H]2CCN([C@H]2C1)n1nccn1
: