Target
Orexin receptor type 2
Ligand
BDBM387137
Substrate
Meas. Tech.
FLIPR Assay
IC50
79.1±n/a nM
Citation
 Kim, RMKuduk, SDLiverton, NZhou, G 6,5-bicyclic octahydropyrrolopyridine orexin receptor antagonists US Patent  US9938276 Publication Date 4/10/2018 
Target
Name:
Orexin receptor type 2
Synonyms:
HCRTR2 OX2R_HUMAN Orexin receptor type 2 (OR-2) Orexin receptor type 2 (OX2R) Ox-2-R | Ox2-R
Type:
Protein
Mol. Mass.:
50710.53
Organism:
Homo sapiens (Human)
Description:
O43614
Residue:
444
  
Inhibitor
Name:
BDBM387137
Synonyms:
2-((3aS, 7aS)-6-(2- (trifluoromethoxy)benzoyl)octahydro- 1H-pyrrolo[2,3-c]pyridin-1- yl)isonicotinonitrile | US9938276, D3
Type:
Small organic molecule
Emp. Form.:
C21H19F3N4O2
Mol. Mass.:
416.3964
SMILES:
FC(F)(F)Oc1ccccc1C(=O)N1CC[C@H]2CCN([C@H]2C1)c1cc(ccn1)C#N
: