Target
Histamine H4 receptor
Ligand
BDBM26397
Substrate
BDBM7966
Meas. Tech.
Radioligand Binding Assay
pH
7.4±n/a
Temperature
298.15±n/a K
Ki
3.5±0.3 nM
Citation
 Cowart, MDAltenbach, RJLiu, HHsieh, GCDrizin, IMilicic, IMiller, TRWitte, DGWishart, NFix-Stenzel, SRMcPherson, MJAdair, RMWetter, JMBettencourt, BMMarsh, KCSullivan, JPHonore, PEsbenshade, TABrioni, JD Rotationally constrained 2,4-diamino-5,6-disubstituted pyrimidines: a new class of histamine H4 receptor antagonists with improved druglikeness and in vivo efficacy in pain and inflammation models. J Med Chem 51:6547-57 (2008)  
Target
Name:
Histamine H4 receptor
Synonyms:
AXOR35 GPCR105 HH4R HRH4 Histamine H4 receptor Histamine receptor (H3 and H4) SP9144
Type:
G Protein-Coupled Receptor (GPCR)
Mol. Mass.:
44517.02
Organism:
Homo sapiens (Human)
Description:
Binding assays were using CHO cells stably expressing hH4R receptors.
Residue:
390
  
Inhibitor
Name:
BDBM26397
Synonyms:
2,4-diamino-5,6-disubstituted pyrimidine, 11 | 6-[(3R)-3-(methylamino)pyrrolidin-1-yl]-3,5-diazatricyclo[9.4.0.0^{2,7}]pentadeca-1(15),2(7),3,5,11,13-hexaen-4-amine
Type:
Small organic molecule
Emp. Form.:
C18H23N5
Mol. Mass.:
309.4087
SMILES:
CN[C@@H]1CCN(C1)c1nc(N)nc-2c1CCCc1ccccc-21
:
Substrate
Name:
BDBM7966
Synonyms:
2-(1H-imidazol-4-yl)ethan-1-amine CHEMBL90 Ergotidine Histamine Peremin | [3H]histamine
Type:
Small organic molecule
Emp. Form.:
C5H9N3
Mol. Mass.:
111.1451
SMILES:
NCCc1cnc[nH]1
: