Target
UDP-N-acetylmuramoylalanine--D-glutamate ligase
Ligand
BDBM26450
Substrate
BDBM26431
Meas. Tech.
MurD Inhibition Assay
pH
8.6±n/a
Temperature
310.15±n/a K
IC50
400000±n/a nM
Citation
 Humljan, JKotnik, MContreras-Martel, CBlanot, DUrleb, UDessen, ASolmajer, TGobec, S Novel Naphthalene-N-sulfonyl-d-glutamic Acid Derivatives as Inhibitors of MurD, a Key Peptidoglycan Biosynthesis Enzyme. J Med Chem 51:7486-94 (2008)  
Target
Name:
UDP-N-acetylmuramoylalanine--D-glutamate ligase
Synonyms:
D-glutamic acid-adding enzyme MurD (E. coli) UDP-N-acetylmuramoyl-L-alanyl-D-glutamate synthetase | murD
Type:
Ligase
Mol. Mass.:
46963.02
Organism:
Escherichia coli (strain K12)
Description:
Residue:
438
  
Inhibitor
Name:
BDBM26450
Synonyms:
(2R)-2-{[6-(cyclopentyloxy)naphthalene-2-]sulfonamido}pentanedioic acid | naphthalene-N-sulfonyl-D-glu derivative, 17i
Type:
Small organic molecule
Emp. Form.:
C20H23NO7S
Mol. Mass.:
421.464
SMILES:
OC(=O)CC[C@@H](NS(=O)(=O)c1ccc2cc(OC3CCCC3)ccc2c1)C(O)=O
:
Substrate
Name:
BDBM26431
Synonyms:
(2R)-2-aminopentanedioic acid D-Glu D-[14C]Glu
Type:
radiolabeled amino acid
Emp. Form.:
C5H9NO4
Mol. Mass.:
147.1293
SMILES:
N[C@H](CCC(O)=O)C(O)=O
: