Target
UDP-N-acetylmuramoylalanine--D-glutamate ligase
Ligand
BDBM26454
Substrate
BDBM26431
Meas. Tech.
MurD Inhibition Assay
pH
8.6±n/a
Temperature
310.15±n/a K
IC50
100000±n/a nM
Citation
 Humljan, JKotnik, MContreras-Martel, CBlanot, DUrleb, UDessen, ASolmajer, TGobec, S Novel Naphthalene-N-sulfonyl-d-glutamic Acid Derivatives as Inhibitors of MurD, a Key Peptidoglycan Biosynthesis Enzyme. J Med Chem 51:7486-94 (2008)  
Target
Name:
UDP-N-acetylmuramoylalanine--D-glutamate ligase
Synonyms:
D-glutamic acid-adding enzyme MurD (E. coli) UDP-N-acetylmuramoyl-L-alanyl-D-glutamate synthetase | murD
Type:
Ligase
Mol. Mass.:
46963.02
Organism:
Escherichia coli (strain K12)
Description:
Residue:
438
  
Inhibitor
Name:
BDBM26454
Synonyms:
(2R)-2-({6-[(4-cyano-2-methoxyphenyl)methoxy]naphthalene-2-}sulfonamido)pentanedioic acid | naphthalene-N-sulfonyl-D-glu derivative, 17m
Type:
Small organic molecule
Emp. Form.:
C24H22N2O8S
Mol. Mass.:
498.505
SMILES:
COc1cc(ccc1COc1ccc2cc(ccc2c1)S(=O)(=O)N[C@H](CCC(O)=O)C(O)=O)C#N
:
Substrate
Name:
BDBM26431
Synonyms:
(2R)-2-aminopentanedioic acid D-Glu D-[14C]Glu
Type:
radiolabeled amino acid
Emp. Form.:
C5H9NO4
Mol. Mass.:
147.1293
SMILES:
N[C@H](CCC(O)=O)C(O)=O
: