Target
Phosphatidylinositol 4,5-bisphosphate 3-kinase catalytic subunit gamma isoform
Ligand
BDBM291361
Substrate
Meas. Tech.
Biochemical Assay
IC50
4946±n/a nM
Citation
 Shuttleworth, SJLiam Cecil, ARHill, TJSilva, FA Tricyclic heterocyclic compounds as phosphoinositide 3-kinase inhibitors US Patent  US9938290 Publication Date 4/10/2018 
Target
Name:
Phosphatidylinositol 4,5-bisphosphate 3-kinase catalytic subunit gamma isoform
Synonyms:
PI3-kinase p110 subunit gamma PI3Kgamma PK3CG_HUMAN Phosphatidylinositol 4,5-bisphosphate 3-kinase (PI3K) Phosphatidylinositol 4,5-bisphosphate 3-kinase catalytic subunit gamma (PI3Kgamma) Phosphatidylinositol 4,5-bisphosphate 3-kinase catalytic subunit gamma isoform (PI3K) Phosphatidylinositol-4,5-bisphosphate 3-kinase catalytic subunit gamma isoform Phosphoinositide 3-kinases gamma (PI3K gamma) p120-PI3K
Type:
Enzyme Subunit
Mol. Mass.:
126470.30
Organism:
Homo sapiens (Human)
Description:
P48736
Residue:
1102
  
Inhibitor
Name:
BDBM291361
Synonyms:
2-(1H-Indol-4-yl)-4-morpholin-4-yl-8-piperidin-1-ylmethyl-pyrido[3′,2′:4,5]furo[3,2d]pyrimidine US9938290, I
Type:
Small organic molecule
Emp. Form.:
C27H28N6O2
Mol. Mass.:
468.5502
SMILES:
C(N1CCCCC1)c1cnc2oc3c(nc(nc3c2c1)-c1cccc2[nH]ccc12)N1CCOCC1
: