Target
Platelet glycoprotein 4
Ligand
BDBM50394994
Substrate
Meas. Tech.
Receptor Binding Assay with 125I-Ghrelin
pH
7.3±n/a
IC50
28000±n/a nM
Comments
extracted
Citation
 Ong, HChemtob, SLubell, WSennlaub, FBoeglin, DProulx, CSajjadi, ZSabatino, D Azapeptides as CD36 binding compounds US Patent  US9708370 Publication Date 7/18/2017 
Target
Name:
Platelet glycoprotein 4
Synonyms:
Adipocyte membrane protein CD_antigen=CD36 Fat Fatty acid transport protein GPIV PAS IV Platelet glycoprotein IV
Type:
PROTEIN
Mol. Mass.:
52740.95
Organism:
Rattus norvegicus
Description:
ChEMBL_858884
Residue:
472
  
Inhibitor
Name:
BDBM50394994
Synonyms:
CHEMBL2163484 | US9708370, DBG-178p
Type:
Small organic molecule
Emp. Form.:
C43H54N12O7
Mol. Mass.:
850.9651
SMILES:
C[C@H](NC(=O)[C@@H](Cc1c[nH]c2ccccc12)NC(=O)[C@@H](N)Cc1cnc[nH]1)C(=O)NN(Cc1ccc(O)cc1)C(=O)N[C@H](Cc1ccccc1)C(=O)N[C@@H](CCCCN)C(N)=O
: