Target
Estrogen receptor [D538G]
Ligand
BDBM50395019
Substrate
Meas. Tech.
HS-R1a radioreceptor assay
IC50
11200±n/a nM
Citation
 Ong, HChemtob, SLubell, WSennlaub, FBoeglin, DProulx, CSajjadi, ZSabatino, D Azapeptides as CD36 binding compounds US Patent  US9708370 Publication Date 7/18/2017 
Target
Name:
Estrogen receptor [D538G]
Synonyms:
ESR ESR1_HUMAN NR3A1
Type:
Enzyme Catalytic Domain
Mol. Mass.:
66173.42
Organism:
Homo sapiens (Human)
Description:
P03372[D538G]
Residue:
595
  
Inhibitor
Name:
BDBM50395019
Synonyms:
CHEMBL2163449 | US9708370, CP-2B(v)
Type:
Small organic molecule
Emp. Form.:
C45H59N11O6
Mol. Mass.:
850.0201
SMILES:
CC(C)CN(NC(=O)[C@@H](Cc1c[nH]c2ccccc12)NC(=O)[C@H](C)N)C(=O)N[C@@H](Cc1c[nH]c2ccccc12)C(=O)N[C@H](Cc1ccccc1)C(=O)N[C@@H](CCCCN)C(N)=O
: