Target
Estrogen receptor [D538G]
Ligand
BDBM50395014
Substrate
Meas. Tech.
HS-R1a radioreceptor assay
IC50
10000±n/a nM
Citation
 Ong, HChemtob, SLubell, WSennlaub, FBoeglin, DProulx, CSajjadi, ZSabatino, D Azapeptides as CD36 binding compounds US Patent  US9708370 Publication Date 7/18/2017 
Target
Name:
Estrogen receptor [D538G]
Synonyms:
ESR ESR1_HUMAN NR3A1
Type:
Enzyme Catalytic Domain
Mol. Mass.:
66173.42
Organism:
Homo sapiens (Human)
Description:
P03372[D538G]
Residue:
595
  
Inhibitor
Name:
BDBM50395014
Synonyms:
CHEMBL2163454 | US9708370, 60 CP-3(iv)
Type:
Small organic molecule
Emp. Form.:
C40H52N10O6
Mol. Mass.:
768.9043
SMILES:
C[C@H](N)C(=O)N[C@H](Cc1c[nH]c2ccccc12)C(=O)N[C@@H](C)C(=O)NN(Cc1ccccc1)C(=O)N[C@H](Cc1ccccc1)C(=O)N[C@@H](CCCCN)C(N)=O
: