Target
Estrogen receptor [D538G]
Ligand
BDBM50395012
Substrate
Meas. Tech.
HS-R1a radioreceptor assay
IC50
10000±n/a nM
Citation
 Ong, HChemtob, SLubell, WSennlaub, FBoeglin, DProulx, CSajjadi, ZSabatino, D Azapeptides as CD36 binding compounds US Patent  US9708370 Publication Date 7/18/2017 
Target
Name:
Estrogen receptor [D538G]
Synonyms:
ESR ESR1_HUMAN NR3A1
Type:
Enzyme Catalytic Domain
Mol. Mass.:
66173.42
Organism:
Homo sapiens (Human)
Description:
P03372[D538G]
Residue:
595
  
Inhibitor
Name:
BDBM50395012
Synonyms:
CHEMBL2163456 | US9708370, 58 CP-3(ii)
Type:
Small organic molecule
Emp. Form.:
C37H50N12O6
Mol. Mass.:
758.8697
SMILES:
C[C@H](NC(=O)[C@@H](Cc1c[nH]c2ccccc12)NC(=O)[C@@H](N)Cc1cnc[nH]1)C(=O)NN(Cc1ccccc1)C(=O)N[C@H](C)C(=O)N[C@@H](CCCCN)C(N)=O
: