Target
Tyrosine-protein kinase JAK1
Ligand
BDBM387169
Substrate
Meas. Tech.
Kinase Assay
IC50
10.00±n/a nM
Citation
 Xi, NLi, MLi, XChen, WZhang, THu, HDai, WWu, Y Substituted heteroaryl compounds and methods of use US Patent  US9938257 Publication Date 4/10/2018 
Target
Name:
Tyrosine-protein kinase JAK1
Synonyms:
JAK-1 JAK1A JAK1_HUMAN Janus kinase 1 (JAK1) | Janus kinase 1 JAK1
Type:
Protein
Mol. Mass.:
133293.73
Organism:
Homo sapiens (Human)
Description:
P23458
Residue:
1154
  
Inhibitor
Name:
BDBM387169
Synonyms:
1-(5-((5-chloro-2-((1-(2-hydroxy-2-methylpropyl)-1H-pyrazol-4-yl)amino)pyrimidin-4-yl)amino)hexahydrocyclopenta[c]pyrrol-2(1H)-yl)ethanone | US9938257, Example 1
Type:
Small organic molecule
Emp. Form.:
C20H28ClN7O2
Mol. Mass.:
433.935
SMILES:
CC(=O)N1CC2CC(CC2C1)Nc1nc(Nc2cnn(CC(C)(C)O)c2)ncc1Cl
: