Target
Tyrosine-protein kinase JAK1
Ligand
BDBM387170
Substrate
Meas. Tech.
Kinase Assay
IC50
2.00±n/a nM
Citation
 Xi, NLi, MLi, XChen, WZhang, THu, HDai, WWu, Y Substituted heteroaryl compounds and methods of use US Patent  US9938257 Publication Date 4/10/2018 
Target
Name:
Tyrosine-protein kinase JAK1
Synonyms:
JAK-1 JAK1A JAK1_HUMAN Janus kinase 1 (JAK1) | Janus kinase 1 JAK1
Type:
Protein
Mol. Mass.:
133293.73
Organism:
Homo sapiens (Human)
Description:
P23458
Residue:
1154
  
Inhibitor
Name:
BDBM387170
Synonyms:
3-(5-((5-chloro-2-((1-(2-hydroxy-2-methylpropyl)-1H-pyrazol-4-yl)amino)pyrimidin-4-yl)amino)hexahydrocyclopenta[c]pyrrol-2(1H)-yl)-3-oxopropanenitrile | US9938257, Example 2
Type:
Small organic molecule
Emp. Form.:
C21H27ClN8O2
Mol. Mass.:
458.944
SMILES:
CC(C)(O)Cn1cc(Nc2ncc(Cl)c(NC3CC4CN(CC4C3)C(=O)CC#N)n2)cn1
: