Target
Aurora kinase B
Ligand
BDBM387186
Substrate
Meas. Tech.
Kinase Assay
IC50
1.000±n/a nM
Citation
 Xi, NLi, MLi, XChen, WZhang, THu, HDai, WWu, Y Substituted heteroaryl compounds and methods of use US Patent  US9938257 Publication Date 4/10/2018 
Target
Name:
Aurora kinase B
Synonyms:
AIK2 AIM1 ARK2 AURKB_HUMAN Aurora B-INCENP Aurora kinase B (AURKB) STK-1 STK12 Serine/threonine-protein kinase aurora B
Type:
Protein
Mol. Mass.:
39327.72
Organism:
Homo sapiens (Human)
Description:
Q96GD4
Residue:
344
  
Inhibitor
Name:
BDBM387186
Synonyms:
1-(4-((5-chloro-4-((2-(methyl sulfonyl)octahydrocyclopenta[c]pyrrol-5-yl)amino)pyrimidin-2-yl)amino)-1H-pyrazol-1-yl)propan-2-ol | US9938257, Example 38
Type:
Small organic molecule
Emp. Form.:
C18H26ClN7O3S
Mol. Mass.:
455.962
SMILES:
CC(O)Cn1cc(Nc2ncc(Cl)c(NC3CC4CN(CC4C3)S(C)(=O)=O)n2)cn1
: