Target
Aurora kinase A
Ligand
BDBM387211
Substrate
Meas. Tech.
Kinase Inhibitory Activity
IC50
550±n/a nM
Citation
 Xiao, YHuck, BRSutton, AERichardson, TEKarra, SR C-ring modified tricyclic benzonaphthiridinone protein kinase inhibitors and use thereof US Patent  US9938268 Publication Date 4/10/2018 
Target
Name:
Aurora kinase A
Synonyms:
AIK ARK1 AURKA AYK1 Aurora kinase A (AURA) Aurora kinase A (Aurora A) Aurora-related kinase 1 BTAK Breast-tumor-amplified kinase STK15 Serine/threonine kinase 15 Serine/threonine-protein kinase aurora A hARK1
Type:
Serine/threonine-protein kinase
Mol. Mass.:
45830.98
Organism:
Homo sapiens (Human)
Description:
O14965
Residue:
403
  
Inhibitor
Name:
BDBM387211
Synonyms:
US9938268, Compound 27
Type:
Small organic molecule
Emp. Form.:
C24H21N5O2
Mol. Mass.:
411.4558
SMILES:
O=C(Nc1ccc(Nc2ccnc3[nH]c(=O)c4CNCCc4c23)cc1)c1ccccc1
: