Target
Aurora kinase A
Ligand
BDBM387230
Substrate
Meas. Tech.
Kinase Inhibitory Activity
IC50
5.5±n/a nM
Citation
 Xiao, YHuck, BRSutton, AERichardson, TEKarra, SR C-ring modified tricyclic benzonaphthiridinone protein kinase inhibitors and use thereof US Patent  US9938268 Publication Date 4/10/2018 
Target
Name:
Aurora kinase A
Synonyms:
AIK ARK1 AURKA AYK1 Aurora kinase A (AURA) Aurora kinase A (Aurora A) Aurora-related kinase 1 BTAK Breast-tumor-amplified kinase STK15 Serine/threonine kinase 15 Serine/threonine-protein kinase aurora A hARK1
Type:
Serine/threonine-protein kinase
Mol. Mass.:
45830.98
Organism:
Homo sapiens (Human)
Description:
O14965
Residue:
403
  
Inhibitor
Name:
BDBM387230
Synonyms:
US9938268, Compound 52
Type:
Small organic molecule
Emp. Form.:
C26H19F5N4O2
Mol. Mass.:
514.4467
SMILES:
Fc1ccc(C(=O)Nc2ccc(Nc3ccnc4[nH]c(=O)c5CCCCc5c34)c(F)c2)c(c1)C(F)(F)F
: