Target
Dihydrofolate reductase
Ligand
BDBM26523
Substrate
BDBM18044
Meas. Tech.
Enzyme Inhibition Assay
pH
7±n/a
Temperature
298.15±n/a K
IC50
3200±n/a nM
Citation
 Beierlein, JMFrey, KMBolstad, DBPelphrey, PMJoska, TMSmith, AEPriestley, NDWright, DLAnderson, AC Synthetic and Crystallographic Studies of a New Inhibitor Series Targeting Bacillus anthracis Dihydrofolate Reductase. J Med Chem 51:7532-40 (2008)  
Target
Name:
Dihydrofolate reductase
Synonyms:
Dihydrofolate Reductase (DHFR) | baDHFR
Type:
Enzyme
Mol. Mass.:
19120.62
Organism:
Bacillus anthracis
Description:
baDHFR was expressed in E. coli BL21, and purified to homogeneity.
Residue:
162
  
Inhibitor
Name:
BDBM26523
Synonyms:
6-ethyl-5-(3-phenylprop-1-yn-1-yl)pyrimidine-2,4-diamine | Propargyl inhibitor, 24
Type:
Small organic molecule
Emp. Form.:
C15H16N4
Mol. Mass.:
252.3143
SMILES:
CCc1nc(N)nc(N)c1C#CCc1ccccc1
:
Substrate
Name:
BDBM18044
Synonyms:
(2S)-2-[(4-{[(2-amino-4-oxo-1,4,7,8-tetrahydropteridin-6-yl)methyl]amino}phenyl)formamido]pentanedioic acid dihydrofolic acid
Type:
Small organic molecule
Emp. Form.:
C19H21N7O6
Mol. Mass.:
443.4133
SMILES:
Nc1nc2NCC(CNc3ccc(cc3)C(=O)N[C@@H](CCC(O)=O)C(O)=O)=Nc2c(=O)[nH]1
: