Target
72 kDa type IV collagenase
Ligand
BDBM26545
Substrate
BDBM23499
Meas. Tech.
MMP Inhibition Assay
pH
7.4±n/a
Temperature
295.15±n/a K
Ki
>3000±n/a nM
Citation
 Govinda Rao, BBandarage, UKWang, TCome, JHPerola, EWei, YTian, SKSaunders, JO Novel thiol-based TACE inhibitors: rational design, synthesis, and SAR of thiol-containing aryl sulfonamides. Bioorg Med Chem Lett 17:2250-3 (2007)  
Target
Name:
72 kDa type IV collagenase
Synonyms:
72 kDa gelatinase CLG4A Gelatinase A (MMP-2) MMP2_HUMAN Matrix metalloproteinase-2 (MMP 2) Matrix metalloproteinases 2 (MMP-2) | TBE-1
Type:
Enzyme
Mol. Mass.:
73870.36
Organism:
Homo sapiens (Human)
Description:
P08253
Residue:
660
  
Inhibitor
Name:
BDBM26545
Synonyms:
1-{[4-(but-2-yn-1-yloxy)benzene]sulfonyl}piperidine-3-thiol thiol-arylsulfonamide, 4d
Type:
Small organic molecule
Emp. Form.:
C15H19NO3S2
Mol. Mass.:
325.446
SMILES:
CC#CCOc1ccc(cc1)S(=O)(=O)N1CCCC(S)C1
:
Substrate
Name:
BDBM23499
Synonyms:
7-methoxycoumarin-PQGL-(3-[2,4-dinitrophenyl]-L-2,3-diaminopropionyl)-AR-OH | Wammp-5
Type:
Fluorogenic substrate
Emp. Form.:
Mol. Mass.:
SMILES:
: