Target
Matrix metalloproteinase-9
Ligand
BDBM26543
Substrate
BDBM23499
Meas. Tech.
MMP Inhibition Assay
pH
7.4±n/a
Temperature
295.15±n/a K
Ki
200±n/a nM
Citation
 Govinda Rao, BBandarage, UKWang, TCome, JHPerola, EWei, YTian, SKSaunders, JO Novel thiol-based TACE inhibitors: rational design, synthesis, and SAR of thiol-containing aryl sulfonamides. Bioorg Med Chem Lett 17:2250-3 (2007)  
Target
Name:
Matrix metalloproteinase-9
Synonyms:
67 kDa matrix metalloproteinase-9 92 kDa gelatinase CLG4B Gelatinase B MMP9 Matrix metalloproteinase 9 (MMP-9) Matrix metalloproteinase-9 (MMP9)
Type:
Enzyme
Mol. Mass.:
78452.28
Organism:
Homo sapiens (Human)
Description:
P14780
Residue:
707
  
Inhibitor
Name:
BDBM26543
Synonyms:
(3R)-1-{[4-(but-2-yn-1-yloxy)benzene]sulfonyl}pyrrolidine-3-thiol thiol-arylsulfonamide, 4b
Type:
Small organic molecule
Emp. Form.:
C14H17NO3S2
Mol. Mass.:
311.42
SMILES:
CC#CCOc1ccc(cc1)S(=O)(=O)N1CC[C@@H](S)C1
:
Substrate
Name:
BDBM23499
Synonyms:
7-methoxycoumarin-PQGL-(3-[2,4-dinitrophenyl]-L-2,3-diaminopropionyl)-AR-OH | Wammp-5
Type:
Fluorogenic substrate
Emp. Form.:
Mol. Mass.:
SMILES:
: