Target
Plasma kallikrein
Ligand
BDBM263317
Substrate
Kallikrein 1
Meas. Tech.
Inhibitory Activity Assay
IC50
4.15±n/a nM
Citation
 Davie, RLEdwards, HJEvans, DMHodgson, STMiller, INovak, ARSmith, AJStocks, MJ Heterocyclic derivates US Patent  US9533987 Publication Date 1/3/2017 
Target
Name:
Plasma kallikrein
Synonyms:
Fletcher factor KLKB1 Kallikrein Plasma kallikrein heavy chain Plasma prekallikrein
Type:
Protein
Mol. Mass.:
71391.16
Organism:
Homo sapiens (Human)
Description:
P03952
Residue:
638
  
Inhibitor
Name:
BDBM263317
Synonyms:
3-amino-1-(6-pyrrolidin-1-yl-pyridin-3-ylmethyl)-1h-pyrazole-4-carboxylic acid(1-amino-isoquinolin-6-ylmethyl)-amide | US9533987, example 99
Type:
Small organic molecule
Emp. Form.:
C24H26N8O
Mol. Mass.:
442.5162
SMILES:
Nc1nn(Cc2ccc(nc2)N2CCCC2)cc1C(=O)NCc1ccc2c(N)nccc2c1
:
Substrate
Name:
Kallikrein-1
Synonyms:
KLK1 Kallikrein 1 Kidney/pancreas/salivary gland kallikrein | Tissue kallikrein
Type:
Enzyme
Mol. Mass.:
28874.69
Organism:
Homo sapiens (Human)
Description:
P06870
Residue:
262