Target
Disintegrin and metalloproteinase domain-containing protein 17
Ligand
BDBM26565
Substrate
TACE substrate peptide
Meas. Tech.
Enzyme Inhibition Assay
pH
7.5±n/a
Temperature
298.15±n/a K
IC50
1±n/a nM
Citation
 Lu, ZOtt, GRAnand, RLiu, RQCovington, MBVaddi, KQian, MNewton, RCChrist, DDTrzaskos, JDuan, JJ Potent, selective, orally bioavailable inhibitors of tumor necrosis factor-alpha converting enzyme (TACE): discovery of indole, benzofuran, imidazopyridine and pyrazolopyridine P1' substituents. Bioorg Med Chem Lett 18:1958-62 (2008)  
Target
Name:
Disintegrin and metalloproteinase domain-containing protein 17
Synonyms:
A disintegrin and metalloproteinase domain 17 ADAM 17 Snake venom-like protease TNF-alpha-Converting Enzyme
Type:
Metalloprotease
Mol. Mass.:
12197.99
Organism:
Sus scrofa (pig)
Description:
Partially purified TACE was obtained from porcine spleen.
Residue:
112
  
Inhibitor
Name:
BDBM26565
Synonyms:
(3S,4S)-3-N-hydroxy-4-N-{4-[(2-methyl-1-benzofuran-3-yl)methyl]benzene}pyrrolidine-3,4-dicarboxamide | 2-methylbenzofuran, 26
Type:
Small organic molecule
Emp. Form.:
C22H23N3O4
Mol. Mass.:
393.4357
SMILES:
Cc1oc2ccccc2c1Cc1ccc(cc1)C(=O)N[C@@H]1CNC[C@@H]1C(=O)NO
:
Substrate
Name:
TACE substrate peptide
Synonyms:
Type:
Internally quenched peptide
Mol. Mass.:
4119.10
Organism:
Description:
MCA, (7-methoxycoumarin-4-yl)acetyl. Dpa, N-3-(2,4-dinitrophenyl)-L-2,3-diaminopropionyl.
Residue:
39