Target
Matrilysin
Ligand
BDBM26560
Substrate
MMP Substrate Peptide
Meas. Tech.
Enzyme Inhibition Assay
Ki
1336±n/a nM
Citation
 Lu, ZOtt, GRAnand, RLiu, RQCovington, MBVaddi, KQian, MNewton, RCChrist, DDTrzaskos, JDuan, JJ Potent, selective, orally bioavailable inhibitors of tumor necrosis factor-alpha converting enzyme (TACE): discovery of indole, benzofuran, imidazopyridine and pyrazolopyridine P1' substituents. Bioorg Med Chem Lett 18:1958-62 (2008)  
Target
Name:
Matrilysin
Synonyms:
MMP7 MPSL1 Matrix metalloproteinase-7 (MMP-7) PUMP1
Type:
Enzyme
Mol. Mass.:
29681.54
Organism:
Homo sapiens (Human)
Description:
P09237
Residue:
267
  
Inhibitor
Name:
BDBM26560
Synonyms:
(3S,4S)-3-N-hydroxy-4-N-{4-[(2-methyl-1H-indol-3-yl)methyl]benzene}pyrrolidine-3,4-dicarboxamide | 2-methyl indole, 16
Type:
Small organic molecule
Emp. Form.:
C22H24N4O3
Mol. Mass.:
392.451
SMILES:
Cc1[nH]c2ccccc2c1Cc1ccc(cc1)C(=O)N[C@@H]1CNC[C@@H]1C(=O)NO
:
Substrate
Name:
MMP Substrate Peptide
Synonyms:
Type:
Fluorogenic Peptide
Mol. Mass.:
2468.31
Organism:
Description:
MCA, (7-methoxycoumarin-4-yl)acetyl. Dpa, N-3-(2,4-dinitrophenyl)-L-2,3-diaminopropionyl.
Residue:
23