Target
DNA-(apurinic or apyrimidinic site) endonuclease
Ligand
BDBM26594
Substrate
DNA Substrate
Meas. Tech.
APE1 Inhibition Assay
pH
7.5±n/a
Temperature
303.15±n/a K
IC50
8000±1000 nM
Citation
 Zawahir, ZDayam, RDeng, JPereira, CNeamati, N Pharmacophore guided discovery of small-molecule human apurinic/apyrimidinic endonuclease 1 inhibitors. J Med Chem 52:20-32 (2009)  
Target
Name:
DNA-(apurinic or apyrimidinic site) endonuclease
Synonyms:
APE APEX APEX1_HUMAN Apurinic-apyrimidinic endonuclease 1 (APE-1) DNA-(apurinic or apyrimidinic site) lyase REF1
Type:
Protein
Mol. Mass.:
35560.12
Organism:
Homo sapiens (Human)
Description:
P27695
Residue:
318
  
Inhibitor
Name:
BDBM26594
Synonyms:
2-(5-{[2-(2-carboxyphenyl)-1,3-dioxo-2,3-dihydro-1H-isoindol-5-yl]carbonyl}-1,3-dioxo-2,3-dihydro-1H-isoindol-2-yl)benzoic acid | A1NI2-A3NI1,19
Type:
Small organic molecule
Emp. Form.:
C31H16N2O9
Mol. Mass.:
560.4667
SMILES:
OC(=O)c1ccccc1N1C(=O)c2ccc(cc2C1=O)C(=O)c1ccc2C(=O)N(C(=O)c2c1)c1ccccc1C(O)=O
:
Substrate
Name:
DNA Substrate
Synonyms:
Annealed double-stranded oligonucleotide with an abasic site
Type:
Radiolabeled substrate
Mol. Mass.:
2306.64
Organism:
Description:
The top strand is 5-ATTTCACCGGTACG(F)TCTAGAATCC-3 containing the tetrahydrofuran synthetic abasic residue (F). It is radiolabeled with gamma-32P.
Residue:
26